{"text_format":"1","workbook":"xlsx","n_sheets":17,"sheets":["CONTROL","Contents","Legislation","INSTRUCTIONS","Auditor Rpt","Management Letter","Enrolment Report","Statement of Financial Position","Surplus","Statement of Operations","Expenditures","Special Ed","Allowable","Personnel","Notes","Notes (2)","Code"],"not_rendered":{"charts":0,"images":4,"macros":1,"external_links":2,"defined_names":541,"comments":1,"pivot_tables":0},"unopened":[],"bounds":{"document_bytes":16777216,"sheet_cells":100000,"rows_first":2000,"rows_last":500,"rows_between":2000,"halvings":0,"cell_chars":16384,"cell_head_chars":4096},"cells_cut":0,"cells_raw":0,"read":"whole","date_system":"1900"}

{"sheet":"CONTROL","index":0,"n_rows":66,"n_cols":31,"rows_kept":66,"cut":false,"hidden":false,"merged":[[30,2,34,5],[9,1,9,2],[36,2,39,5],[3,1,3,5],[1,1,1,5],[9,3,9,5],[12,3,12,5]]}
[null,null,null,null,null,null,null,null,null,null,null,null,null,null,null,null,null,null,null,null,null,null,null,null,{"$f":"VLOOKUP(Code!G3,Y2:Y65,3,FALSE)","v":{"$error":"#N/A"}},null,null,null,null,null,6]
[null,"INDEPENDENT SCHOOL FRAME FINANCIAL STATEMENT"]
[null,null,null,null,null,null,null,null,null,null,null,null,null,null,null,null,null,null,null,null,null,null,null,null,"2221"]
[null,"CONTROL WORKSHEET AND PRINTING ",null,null,null,null,null,null,null,null,null,null,null,null,null,null,null,null,null,null,null,null,null,null,"2114"]
[null,null,null,null,null,null,null,null,null,null,null,null,null,null,null,null,null,null,null,null,null,null,null,null,"1733"]
[null,null,"Choose school here > ",null,null,null,null,null,null,null,null,null,null,null,null,null,null,null,null,null,null,null,null,null,"1536"]
[]
[null,null,"School #",{"$f":"+Code!H3","v":""}]
[null,null,null,null,null,null,null,null,null,null,null,null,null,null,null,null,null,null,null,null,null,null,null,null,"2102"]
[null,"Correct the name, if you need here >",null,{"$f":"IF(D8=\"\",\"\",+Code!I79)","v":""},null,null,null,null,null,null,null,null,null,null,null,null,null,null,null,null,null,null,null,null,"1077"]
[null,null,null,null,null,null,null,null,null,null,null,null,null,null,null,null,null,null,null,null,null,null,null,null,"2055"]
[null,null,null,null,null,null,null,null,null,null,null,null,null,null,null,null,null,null,null,null,null,null,null,null,"1482"]
[null,null,"Name of person inputting this file > ",null,null,null,null,null,null,null,null,null,null,null,null,null,null,null,null,null,null,null,null,null,"1148"]
[null,null,null,null,null,null,null,null,null,null,null,null,null,null,null,null,null,null,null,null,null,null,null,null,"1239"]
[null,null,"Phone number > ",null,null,null,null,null,null,null,null,null,null,null,null,null,null,null,null,null,null,null,null,null,"1157"]
{"$rows_left_out":52}
{"sheet":"Contents","index":1,"n_rows":17,"n_cols":4,"rows_kept":17,"cut":false,"hidden":false,"merged":[]}
[null,{"$f":"SCHOOLNAME","v":""}]
[null,"AUDITOR'S REPORT AND FINANCIAL STATEMENTS"]
[null,"TABLE OF CONTENTS"]
[null,null,null,"PAGE"]
[null,null,"LEGISLATIVE AUTHORITY / REQUIREMENTS","i "]
[null,null,"INSTRUCTIONS FOR THE COMPLETION OF THE FINANCIAL STATEMENTS","ii "]
[null,null,"AUDITOR'S REPORT",1]
[null,null,"AUDITOR'S SUPPLEMENTARY REPORT",2]
[null,null,"OPERATING FUND"]
[null,null,"     STATEMENT OF FINANCIAL POSITION",3]
[null,null,"     STATEMENT OF SURPLUS (DEFICIT)",4]
[null,null,"    STATEMENT OF OPERATIONS",5]
[null,null,"     STATEMENT OF EXPENDITURES (by Function and by Object)",6]
[null,null,"     SPECIAL EDUCATION SERVICES EXPENDITURE DETAIL (by Program)",7]
[null,null,"STATEMENT OF ALLOWABLE EXPENDITURES",8]
{"$rows_left_out":3}
{"sheet":"Legislation","index":2,"n_rows":61,"n_cols":54,"rows_kept":61,"cut":false,"hidden":false,"merged":[[40,49,42,50]]}
[null,"Independent Schools"]
[]
[null,"Legislative Authority/Requirements"]
[]
[null,"In accordance with The Private Schools Grants Regulation 61/2012"]
[]
[null,"Auditor "]
[null,"Each year, a private school shall appoint an auditor and advise the minister of the auditor’s name and address. "]
[null,"If the auditor is the same as in the previous year, it is not necessary to advise the minister."]
[]
[null,"The auditor must be a professional accountant who is a registered member in good standing of Chartered"]
[null,"Professional Accountants, Manitoba."]
[]
[null,"Annual Audit "]
[null,"Each year, the auditor shall examine the financial affairs, books, accounts, records and transactions of the"]
{"$rows_left_out":47}
{"sheet":"INSTRUCTIONS","index":3,"n_rows":99,"n_cols":2,"rows_kept":99,"cut":false,"hidden":false,"merged":[[18,3,18,4],[11,1,11,2],[5,1,5,2],[6,1,6,2],[7,1,7,2],[8,1,8,2],[9,1,9,2],[12,1,12,2],[26,1,30,1],[20,1,22,1],[13,1,13,2],[15,1,15,2],[17,1,17,2],[18,1,18,2]]}
[]
[null,"TO PRINT, CLICK THE PRINTER ICON ON YOUR TOOLBAR (PRINTS 2 LETTER SIZE PAGES)"]
[]
[null,"INSTRUCTIONS FOR THE COMPLETION AND SUBMISSION OF FINANCIAL STATEMENTS"]
[]
["1)","MACROS: For full functionality, set Excel to allow macros. To do this in Excel 2007 or later versions:"]
[null,"Excel 2007: Click the Microsoft Office Button (upper left corner of your screen)"]
[null,"At the bottom of the pop-up box, click the Excel Options button"]
[null,"Excel 2010: Click the File tab (upper left corner of your screen)"]
[null,"On the bottom of the side menu, click Options"]
[null,"Then (same for both versions):"]
[null,"Click TRUST CENTER on the side menu."]
[null,"Click the Trust Center Settings button on the right hand side and click Macro Settings on the next side menu."]
[null,"On the list of options under Macro Settings click Disable all macros with notification. Click OK."]
[]
{"$rows_left_out":85}
{"sheet":"Auditor Rpt","index":4,"n_rows":44,"n_cols":6,"rows_kept":44,"cut":false,"hidden":false,"merged":[[3,3,4,5],[41,3,41,4],[36,3,36,5],[42,3,42,5],[6,4,6,5],[7,1,7,5],[37,3,37,5],[8,1,35,5]]}
[]
[]
[null,"AUDITOR'S REPORT"]
[null,null,null,{"$f":"IF(ISBLANK(SCHOOLNAME),\"\",SCHOOLNAME)","v":""}]
[null,"TO THE BOARD OF DIRECTORS OF "]
[]
[null,"We have audited the Operating Fund Balance Sheet of "]
[null,{"$f":"D4","v":""}]
[]
[]
[]
[]
[]
[]
[]
{"$rows_left_out":30}
{"sheet":"Management Letter","index":5,"n_rows":4,"n_cols":3,"rows_kept":4,"cut":false,"hidden":false,"merged":[[1,1,1,5],[3,2,3,4],[5,1,38,4]]}
[]
[null,"AUDITOR'S SUPPLEMENTARY REPORT"]
[null,"MANAGEMENT LETTER"]
[null,"To The Board of ",{"$f":"IF(ISBLANK(SCHOOLNAME),\"\",SCHOOLNAME)","v":""}]

{"sheet":"Enrolment Report","index":6,"n_rows":39,"n_cols":4,"rows_kept":39,"cut":false,"hidden":false,"merged":[[2,1,2,3],[19,1,19,3],[32,1,32,3],[5,2,5,3],[9,2,9,3]]}
[null,{"$f":"SCHOOLNAME","v":""}]
[null,"AUDITOR'S SUPPLEMENTARY REPORT"]
[null,"AUDITOR'S  REPORT ON ENROLMENT"]
[null,null,null,{"$f":"\"at \"&Enryr","v":"at September 29, 2022"}]
[]
[null,"To the Board of ",{"$f":"IF(ISBLANK(SCHOOLNAME),\"\",SCHOOLNAME)","v":""}]
[]
[null,"We have audited the EIS Certification and Enrolment Report (IS EIS CERT-PART 2 OF 2) prepared in "]
[null,"accordance  with Part1, Section 1.1 of the Independent Schools Funding Reporting Requirements for the "]
[null,{"$f":"\"school year \"&SCHYR&\" \"&\"of  the\"","v":"school year 2022/2023 of  the"},{"$f":"IF(ISBLANK(SCHOOLNAME),\"\",SCHOOLNAME)","v":""}]
[null,"at September 29.  The enrolment information is the responsibility of the School's management."]
[null,"Our responsibility is to express an opinion on this enrolment information based on our audit."]
[]
[null,"We conducted our audit in accordance with the standards for assurance engagements set out in the CPA"]
[null,"Canada Handbook - Assurance. Those standards require that we plan and perform an audit to obtain reasonable "]
{"$rows_left_out":25}
{"sheet":"Statement of Financial Position","index":7,"n_rows":38,"n_cols":8,"rows_kept":38,"cut":false,"hidden":false,"merged":[[32,2,32,3],[33,2,33,3],[34,2,34,3],[12,2,12,3],[13,2,13,3],[14,2,14,3],[20,2,20,3]]}
[null,{"$f":"IF(ISBLANK(SCHOOLNAME),\"\",SCHOOLNAME)","v":""},null,null,null,null,null,{"$f":"IF(DATE=0,\"\",DATE)","v":"2023-08-17T14:01:08.790"}]
[]
[null,"OPERATING FUND - STATEMENT OF FINANCIAL POSITION"]
[null,{"$f":"\"As at \"&YrEnded&\" \"&THISYR","v":"As at June 30, 2023"}]
[null," ASSETS"]
[null," Cash",null,null,null,null,null,0]
[null," Investments",null,null,null,null,null,0]
[null," Accounts Receivable"]
[null,null,"Provincial Government",null,null,0]
[null,null,"Federal Government",null,null,0]
[null,null,"School Fees",null,null,0]
[null,null,"Other (please specify)"]
[null,null,null,null,null,0]
[null,null,null,null,null,0]
[null,null,null,null,null,0,null,{"$f":"SUM(F9:F11,F13:F15)","v":0}]
{"$rows_left_out":24}
{"sheet":"Surplus","index":8,"n_rows":13,"n_cols":8,"rows_kept":13,"cut":false,"hidden":false,"merged":[[8,2,8,3],[9,2,9,3],[10,2,10,3],[11,2,11,3]]}
[null,{"$f":"IF(ISBLANK(SCHOOLNAME),\"\",SCHOOLNAME)","v":""},null,null,null,null,null,{"$f":"IF(DATE=0,\"\",DATE)","v":"2023-08-17T14:01:08.790"}]
[null,"OPERATING FUND"]
[null,"STATEMENT OF SURPLUS (DEFICIT)"]
[null,{"$f":"ForYr","v":"For the Year Ended June 30, 2023"}]
[]
[null,{"$f":"\" Accumulated Surplus (Deficit), June 30, \"&LASTYR","v":" Accumulated Surplus (Deficit), June 30, 2022"},null,null,null,null,null,0]
[null," Add: Net Current Year Surplus (Deficit)",null,null,null,null,null,{"$f":"NETSURPLUS","v":0}]
[null," Adjustments Affecting Prior Year(s)"]
[null,null,null,null,null,0]
[null,null,null,null,null,0]
[null,null,null,null,null,0]
[null,null,null,null,null,0,null,{"$f":"SUM(F9:F12)","v":0}]
[null,{"$f":"\" Accumulated Surplus (Deficit), June 30, \"&THISYR","v":" Accumulated Surplus (Deficit), June 30, 2023"},null,null,null,null,null,{"$f":"SUM(H6,H7,H12)","v":0}]

{"sheet":"Statement of Operations","index":9,"n_rows":41,"n_cols":8,"rows_kept":41,"cut":false,"hidden":false,"merged":[]}
[null,{"$f":"IF(ISBLANK(SCHOOLNAME),\"\",SCHOOLNAME)","v":""},null,null,null,null,null,{"$f":"IF(DATE=0,\"\",DATE)","v":"2023-08-17T14:01:08.790"}]
[]
[null,"OPERATING FUND"]
[null,"STATEMENT OF OPERATIONS"]
[null,{"$f":"ForYr","v":"For the Year Ended June 30, 2023"}]
[]
[null," REVENUES"]
[null,null,"Provincial Government"]
[null,null,"  Department of Education"]
[null,null,null,"Instruction and Services",null,{"$f":"IF(OR(+Allowable!H26=0,+Allowable!H26=\"\"),0,+Allowable!H26)","v":0}]
[null,null,null,"Student Support Services",null,{"$f":"+Allowable!F26","v":0}]
[null,null,null,"Curricular Materials",null,0,null,{"$f":"SUM(F10:F12)","v":0}]
[null,null,null,"Other (please specify)"]
[null,null,null,null,null,null,null,0]
[null,null,"Federal Government"]
{"$rows_left_out":27}
{"sheet":"Expenditures","index":10,"n_rows":46,"n_cols":11,"rows_kept":46,"cut":false,"hidden":false,"merged":[[2,4,3,5],[22,10,23,10]]}
[{"$f":"IF(ISBLANK(SCHOOLNAME),\"\",SCHOOLNAME)","v":""},"OPERATING FUND STATEMENT OF EXPENDITURE",null,null,null,null,null,null,null,{"$f":"IF(DATE=0,\"\",DATE)","v":"2023-08-17T14:01:08.790"}]
[null,{"$f":"ForYr","v":"For the Year Ended June 30, 2023"}]
[null,null,"STUDENT",null,"ADMINISTRATION",null,"INSTRUCTIONAL","TRANSPORTATION"]
[null,null,"SUPPORT","PRE-KINDERGARTEN",null,null,"AND PUPIL","/ BOARDING","OPERATIONS"]
[null,"REGULAR","SERVICES","EDUCATION","BOARD OF","SCHOOL","SUPPORT","OF","AND"]
["CODE         OBJECT \\ FUNCTION","INSTRUCTION","(see note)",null,"DIRECTORS","ADMINISTRATION","SERVICES","PUPILS","MAINTENANCE","TOTALS"]
[" 300 SALARIES"]
[" 310   Directors Remuneration",null,null,null,null,null,null,null,null,{"$f":"E8","v":0}]
[" 320   Executive, Managerial and Supervisory",null,{"$f":"IF(_OE2320=0,0,_OE2320)","v":0},null,null,null,null,null,null,{"$f":"SUM(B9:I9)","v":0}]
[" 330   Instructional - Teaching",null,{"$f":"IF(_OE2330=0,0,_OE2330)","v":0},null,null,null,null,null,null,{"$f":"SUM(B10:D10,G10)","v":0}]
[" 350   Instructional - Other",null,{"$f":"IF(_OE2350=0,0,_OE2350)","v":0},null,null,null,null,null,null,{"$f":"SUM(B11:D11,G11,H11)","v":0}]
[" 360   Technical, Specialized and Service",null,{"$f":"IF(_OE2360=0,0,_OE2360)","v":0},null,null,null,null,null,null,{"$f":"SUM(B12:I12)","v":0}]
[" 370   Secretarial, Clerical and Other",null,{"$f":"IF(_OE2370=0,0,_OE2370)","v":0},null,null,null,null,null,null,{"$f":"SUM(B13:I13)","v":0}]
[" 380   Clinicians",null,{"$f":"IF(_OE2380=0,0,_OE2380)","v":0},null,null,null,null,null,null,{"$f":"_OE238","v":0}]
["       Total Salaries",{"$f":"SUM(B9:B13)","v":0},{"$f":"SUM(C9:C14)","v":0},{"$f":"SUM(D9:D13)","v":0},{"$f":"SUM(E8,E9,E12,E13)","v":0},{"$f":"SUM(F9,F12,F13)","v":0},{"$f":"SUM(G9:G13)","v":0},{"$f":"SUM(H9,H11:H13)","v":0},{"$f":"SUM(I9,I12,I13)","v":0},{"$f":"SUM(B15:I15)","v":0}]
{"$rows_left_out":32}
{"sheet":"Special Ed","index":11,"n_rows":36,"n_cols":9,"rows_kept":36,"cut":false,"hidden":false,"merged":[[16,8,18,8]]}
[{"$f":"IF(ISBLANK(SCHOOLNAME),\"\",SCHOOLNAME)","v":""},"SPECIAL EDUCATION SERVICES EXPENDITURES DETAIL",null,null,null,null,null,{"$f":"IF(DATE=0,\"\",DATE)","v":"2023-08-17T14:01:08.790"}]
[null,{"$f":"ForYr","v":"For the Year Ended June 30, 2023"}]
[{"$f":"IF(AND(OE2TOT>25000,_TOT200=0),\"Error: You Need to complete this worksheet\",\"\")","v":""},"* TO BE COMPLETED BY SCHOOLS WITH TOTAL SPECIAL EDUCATION SERVICES EXPENDITURES GREATER THAN $25,000"]
[null,null,null,"CLINICAL AND",null,null,"OTHER"]
[null,"ADMINISTRATION","GIFTED","RELATED","SPECIAL ","REGULAR","RESOURCE"]
["CODE         OBJECT \\ PROGRAM","/CO-ORDINATION","EDUCATION","SERVICES","PLACEMENT","PLACEMENT","SERVICES","TOTALS"]
[" 300 SALARIES"]
[" 320   Executive, Managerial and Supervisory",null,null,null,null,null,null,{"$f":"SUM(B8,C8,E8)","v":0}]
[" 330   Instructional - Teaching",null,null,null,null,null,null,{"$f":"SUM(C9,E9:G9)","v":0}]
[" 350   Instructional - Other",null,null,null,null,null,null,{"$f":"SUM(C10,E10:G10)","v":0}]
[" 360   Technical, Specialized and Service",null,null,null,null,null,null,{"$f":"SUM(C11,E11:G11)","v":0}]
[" 370   Secretarial, Clerical and Other",null,null,null,null,null,null,{"$f":"SUM(B12:G12)","v":0}]
[" 380   Clinicians",null,null,null,null,null,null,{"$f":"_OE2338","v":0}]
["       Total Salaries",{"$f":"SUM(B8,B12)","v":0},{"$f":"SUM(C8:C12)","v":0},{"$f":"SUM(D12,D13)","v":0},{"$f":"SUM(E8:E12)","v":0},{"$f":"SUM(F9:F12)","v":0},{"$f":"SUM(G9:G12)","v":0},{"$f":"SUM(B14:G14)","v":0}]
[" 400 EMPLOYEES BENEFITS AND ALLOWANCES",null,null,null,null,null,null,{"$f":"SUM(B15:G15)","v":0}]
{"$rows_left_out":22}
{"sheet":"Allowable","index":12,"n_rows":58,"n_cols":11,"rows_kept":58,"cut":false,"hidden":false,"merged":[[49,6,49,7],[48,6,48,7],[45,6,45,7],[46,6,46,7],[28,7,28,8],[41,5,41,7],[47,6,47,7],[44,6,44,7],[42,6,42,7],[43,6,43,7],[0,7,0,9],[9,7,9,8],[6,7,6,8],[7,7,7,8],[8,7,8,8]]}
[{"$f":"IF(ISBLANK(SCHOOLNAME),\"\",SCHOOLNAME)","v":""},null,null,null,null,null,null,{"$f":"IF(DATE=0,\"\",DATE)","v":"2023-08-17T14:01:08.790"}]
[]
["STATEMENT OF ALLOWABLE EXPENDITURES"]
[{"$f":"ForYr","v":"For the Year Ended June 30, 2023"}]
["To be completed by all Independent Schools"]
[]
[null,null,null,null,null,"STUDENT",null,"INSTRUCTION"]
[null,null,null,null,null,"SUPPORT",null,"AND"]
[null,null,null,null,null,"SERVICES",null,"SERVICES"]
[]
["TOTAL EXPENDITURES",null,null,null,null,{"$f":"OE2TOT","v":0}," (1)",{"$f":"TOTEXP","v":0},null," (2)"]
[]
["LESS:","Student Support Services Grants",null,null,null,null,null,{"$f":"F26","v":0},null," (3)",{"$f":"IF(AND(Code!O79>25000,_TOT200=0),\"<= Special Ed tab needs to be completed\",\"\")","v":""}]
[null,"Curricular Materials Grant",null,null,null,{"$f":"ROUND(IF(_OE274=0,0,CURRMAT*(_OE274)/(_OE740)),0)","v":0}," (4)",{"$f":"ROUND(CURRMAT-CURRMATSPEC,0)","v":0},null," (4)"]
[null,"Cost of non-certified teachers teaching courses other than non-credit religion",null,null,null,0," (5)",0,null," (5)"]
{"$rows_left_out":44}
{"sheet":"Personnel","index":13,"n_rows":18,"n_cols":10,"rows_kept":18,"cut":false,"hidden":false,"merged":[[5,3,6,4],[12,9,13,9]]}
[{"$f":"IF(ISBLANK(SCHOOLNAME),\"\",SCHOOLNAME)","v":""},null,null,null,null,null,null,null,{"$f":"IF(DATE=0,\"\",DATE)","v":"2023-08-17T14:01:08.790"}]
[]
["FULL TIME EQUIVALENT PERSONNEL EMPLOYED (UNAUDITED)"]
[{"$f":"Enryr","v":"September 29, 2022"}]
[]
[null,null,null,"ADMINISTRATION",null,"INSTRUCTION","TRANSPORTATION"]
[null,null,"STUDENT",null,null,"AND PUPIL","/ BOARDING","OPERATIONS"]
[null,"REGULAR","SUPPORT","BOARD OF","SCHOOL","SUPPORT","OF","AND"]
["CODE         OBJECT \\ FUNCTION","INSTRUCTION","SERVICES","DIRECTORS","ADMINISTRATION","SERVICES","PUPILS","MAINTENANCE","TOTALS"]
[" 310   Directors (headcount)",null,null,null,null,null,null,null,{"$f":"D10","v":0}]
[" 320   Executive, Managerial and Supervisory",null,null,null,null,null,null,null,{"$f":"SUM(B11:H11)","v":0}]
[" 330   Instructional - Teaching",null,null,null,null,null,null,null,{"$f":"SUM(B12,C12,F12)","v":0}]
[" 350   Instructional - Teacher Aides and Other",null,null,null,null,null,null,null,{"$f":"SUM(B13,C13,F13,G13)","v":0},9]
[" 360   Technical, Specialized and Service",null,null,null,null,null,null,null,{"$f":"SUM(B14:H14)","v":0}]
[" 370   Secretarial, Clerical and Other",null,null,null,null,null,null,null,{"$f":"SUM(B15:H15)","v":0}]
{"$rows_left_out":4}
{"sheet":"Notes","index":14,"n_rows":3,"n_cols":2,"rows_kept":3,"cut":false,"hidden":false,"merged":[[3,1,58,3]]}
[null,{"$f":"SCHOOLNAME","v":""}]
[null,"NOTES TO THE FINANCIAL STATEMENTS"]
[null,{"$f":"ForYr","v":"For the Year Ended June 30, 2023"}]

{"sheet":"Notes (2)","index":15,"n_rows":3,"n_cols":2,"rows_kept":3,"cut":false,"hidden":false,"merged":[[3,1,58,3]]}
[null,{"$f":"SCHOOLNAME","v":""}]
[null,"NOTES TO THE FINANCIAL STATEMENTS"]
[null,{"$f":"ForYr","v":"For the Year Ended June 30, 2023"}]

{"sheet":"Code","index":16,"n_rows":81,"n_cols":37,"rows_kept":81,"cut":false,"hidden":true,"merged":[[80,9,80,12],[80,13,80,17],[0,25,0,28]]}
[null,{"$f":"NOW()","v":"2023-08-17T14:01:08.790"},null,null,null,null,null,null,{"$f":"+Enryr","v":"September 29, 2022"},"Kdg","total Eligible Enrolment","Level 2","Level3","Preliminar I & S Grant","Total Special needs Col S","Total Curricular materials","Total adjustments","TOTAL GRANT PAID",null,null,null,null,null,null,null,"Enrolment Tab",null,null,null,"Funding Tab"]
[null," DATE:",null,null,null,null,null,null,null,null,null,null,null,null,null,null,null,null,null,null,null,null,null,null,"Source File: PY July support file and last school year payment","Col H","Col S","Col T","Col U",null,"Preliminar I & S Grant","Total Special needs ","Total Curricular materials","Total adjustments","TOTAL GRANT PAID","July 2022 Support File","Check"]
[null,null,null,null,null,"Formulas =>",1,{"$f":"IF(G3=1,\"\",VLOOKUP(G3,G4:I74,2,FALSE))","v":""},{"$f":"VLOOKUP(G3,G4:I74,3,FALSE)","v":"Press down arrow for school name =>"},null,null,null,null,null,null,null,null,null,null,null,null,null,null,"School Name",null,"K",{"$f":"+K1","v":"total Eligible Enrolment"},{"$f":"+L1","v":"Level 2"},{"$f":"+M1","v":"Level3"},null,"Column N","Col S","Col O","Col AE","Col AF","Total Grant Paid"]
["ForYr",{"$f":"\"For the Year Ended June 30, \"&FIXED(B7,0,1)","v":"For the Year Ended June 30, 2023"},null,null,null,null,1,null,"Press down arrow for school name =>"]
["ATSEP",{"$f":"\"September 29, \"&FIXED(B6,0,1)","v":"September 29, 2022"},null,null,null,null,{"$f":"+G4+1","v":2},2221,"Academie Islamique",{"$f":"SUMIF($V$5:$V$74,$H5,$Z$5:$Z$74)","v":9},{"$f":"SUMIF($V$5:$V$74,$H5,$AA$5:$AA$74)","v":36},{"$f":"SUMIF($V$5:$V$74,$H5,$AB$5:$AB$74)","v":0},{"$f":"SUMIF($V$5:$V$74,$H5,$AC$5:$AC$74)","v":0},{"$f":"SUMIF($AD$5:$AD$74,$H5,$AE$5:$AE$78)","v":222588},{"$f":"SUMIF($AD$5:$AD$74,$H5,$AF$5:$AF$78)","v":0},{"$f":"SUMIF($AD$5:$AD$74,$H5,$AG$5:$AG$78)","v":2160},{"$f":"SUMIF($AD$5:$AD$74,$H5,$AH$5:$AH$74)","v":0},{"$f":"SUMIF($AD$5:$AD$74,$H5,$AI$5:$AI$74)","v":224748},{"$f":"+N5+O5+P5+Q5-R5","v":0},null,null,2221,"LR ","Academie Islamique ","Academie Islamique ",9,36,0,0,2221,{"$f":"VLOOKUP(AD5,[1]Funding!$B$10:$N$77,13,FALSE)","v":222588},{"$f":"VLOOKUP(AD5,[1]Funding!$B$10:$S$77,18,FALSE)","v":0},{"$f":"VLOOKUP(AD5,[1]Funding!$B$10:$S$77,14,FALSE)","v":2160},{"$f":"VLOOKUP(AD5,[1]Funding!$B$10:$AE$77,30,FALSE)","v":0},{"$f":"SUM(AE5:AH5)","v":224748},{"$f":"VLOOKUP(AD5,[1]Funding!$B$10:$AF$77,31,FALSE)","v":224748},{"$f":"AI5-AJ5","v":0}]
["LASTYR",{"$f":"+THISYR-1","v":2022},null,null,null,null,3,2114,"Alhijra Islamic School",26,245,0,0,1514835,0,14700,0,1529535,{"$f":"+N6+O6+P6+Q6-R6","v":0},null,null,2114,"LR","Alhijra Islamic School","Alhijra Islamic School",26,245,0,0,2114,{"$f":"VLOOKUP(AD6,[1]Funding!$B$10:$N$77,13,FALSE)","v":1514835},{"$f":"VLOOKUP(AD6,[1]Funding!$B$10:$S$77,18,FALSE)","v":0},{"$f":"VLOOKUP(AD6,[1]Funding!$B$10:$S$77,14,FALSE)","v":14700},{"$f":"VLOOKUP(AD6,[1]Funding!$B$10:$AE$77,30,FALSE)","v":0},{"$f":"SUM(AE6:AH6)","v":1529535},{"$f":"VLOOKUP(AD6,[1]Funding!$B$10:$AF$77,31,FALSE)","v":1529535},{"$f":"AI6-AJ6","v":0}]
["THISYR",{"$f":"+YEARINPUT","v":2023},null,null,null,null,4,1733,"Austin Christian Academy",5,57.5,0,1,354597,21076,3450,0,379123,0,null,null,1733,"BE","Austin Christian Academy","Austin Christian Academy Inc",5,57.5,0,1,1733,{"$f":"VLOOKUP(AD7,[1]Funding!$B$10:$N$77,13,FALSE)","v":354597},{"$f":"VLOOKUP(AD7,[1]Funding!$B$10:$S$77,18,FALSE)","v":21076},{"$f":"VLOOKUP(AD7,[1]Funding!$B$10:$S$77,14,FALSE)","v":3450},{"$f":"VLOOKUP(AD7,[1]Funding!$B$10:$AE$77,30,FALSE)","v":0},379123,{"$f":"VLOOKUP(AD7,[1]Funding!$B$10:$AF$77,31,FALSE)","v":379123},0]
["Enryr",{"$f":"\"September 29, \"&FIXED(B6,0,1)","v":"September 29, 2022"},null,null,null,null,5,2336,"Avicenna Academy",0,0,0,0,0,0,0,0,0,0,null,null,2336,"PE","Avicenna Academy","Avicenna Academy",null,null,null,null,2336,null,null,null,null,0,null,{"$f":"AI8-AJ8","v":0}]
["Schyr",{"$f":"+LASTYR&\"/\"&THISYR","v":"2022/2023"},null,null,null,null,6,1536,"Balmoral Hall School",34,415,6,0,2392209,53200,24900,0,2470309,0,null,null,1536,"WI","Balmoral Hall School","Balmoral Hall School For Girls",34,415,6,0,1536,{"$f":"VLOOKUP(AD9,[1]Funding!$B$10:$N$77,13,FALSE)","v":2392209},{"$f":"VLOOKUP(AD9,[1]Funding!$B$10:$S$77,18,FALSE)","v":53200},{"$f":"VLOOKUP(AD9,[1]Funding!$B$10:$S$77,14,FALSE)","v":24900},{"$f":"VLOOKUP(AD9,[1]Funding!$B$10:$AE$77,30,FALSE)","v":0},2470309,{"$f":"VLOOKUP(AD9,[1]Funding!$B$10:$AF$77,31,FALSE)","v":2470309},{"$f":"AI9-AJ9","v":0}]
[null,null,null,null,null,null,7,2102,"Beautiful Savior Lutheran School",14,86,2,0,531738,19000,5160,0,555898,0,null,null,2102,"LR","Beautiful Savior Lutheran School","Beautiful Savior Lutheran School Inc",14,86,2,0,2102,{"$f":"VLOOKUP(AD10,[1]Funding!$B$10:$N$77,13,FALSE)","v":531738},{"$f":"VLOOKUP(AD10,[1]Funding!$B$10:$S$77,18,FALSE)","v":19000},{"$f":"VLOOKUP(AD10,[1]Funding!$B$10:$S$77,14,FALSE)","v":5160},{"$f":"VLOOKUP(AD10,[1]Funding!$B$10:$AE$77,30,FALSE)","v":0},555898,{"$f":"VLOOKUP(AD10,[1]Funding!$B$10:$AF$77,31,FALSE)","v":555898},0]
["June 30,",2023,null,null,null,null,8,1077,"Calvin Christian School",29,423.5,10.5,4,2618501,184270,25410,0,2828181,0,null,null,1077,"RI","Calvin Christian School","Greater Winnipeg Society For Christian Education Inc",29,423.5,10.5,4,1077,{"$f":"VLOOKUP(AD11,[1]Funding!$B$10:$N$77,13,FALSE)","v":2618501},{"$f":"VLOOKUP(AD11,[1]Funding!$B$10:$S$77,18,FALSE)","v":184270},{"$f":"VLOOKUP(AD11,[1]Funding!$B$10:$S$77,14,FALSE)","v":25410},{"$f":"VLOOKUP(AD11,[1]Funding!$B$10:$AE$77,30,FALSE)","v":0},2828181,{"$f":"VLOOKUP(AD11,[1]Funding!$B$10:$AF$77,31,FALSE)","v":2828181},0]
[null,null,null,null,null,null,9,2337,"CanAsia School",0,0,0,0,0,0,0,0,0,0,null,null,2337,"ST","CanAsia School","CanAsia School",null,null,null,null,2337,null,null,null,null,0,null,0]
[null,null,null,null,null,null,10,2055,"Cartwright Community Independent School",0,5,0,0,30915,0,300,0,31215,0,null,null,2055,"PS","Cartwright Community Independent School","Cartwright Community Independent School",0,5,0,0,2055,{"$f":"VLOOKUP(AD13,[1]Funding!$B$10:$N$77,13,FALSE)","v":30915},{"$f":"VLOOKUP(AD13,[1]Funding!$B$10:$S$77,18,FALSE)","v":0},{"$f":"VLOOKUP(AD13,[1]Funding!$B$10:$S$77,14,FALSE)","v":300},{"$f":"VLOOKUP(AD13,[1]Funding!$B$10:$AE$77,30,FALSE)","v":0},31215,{"$f":"VLOOKUP(AD13,[1]Funding!$B$10:$AF$77,31,FALSE)","v":31215},0]
[null,null,null,null,null,null,11,1861,"Children's House",10,5,0,0,29305,0,300,0,29605,0,null,null,1861,"WI","Children's House","St Mary's Montessori School Inc",10,5,0,0,1861,{"$f":"VLOOKUP(AD14,[1]Funding!$B$10:$N$77,13,FALSE)","v":29305},{"$f":"VLOOKUP(AD14,[1]Funding!$B$10:$S$77,18,FALSE)","v":0},{"$f":"VLOOKUP(AD14,[1]Funding!$B$10:$S$77,14,FALSE)","v":300},{"$f":"VLOOKUP(AD14,[1]Funding!$B$10:$AE$77,30,FALSE)","v":0},29605,{"$f":"VLOOKUP(AD14,[1]Funding!$B$10:$AF$77,31,FALSE)","v":29605},0]
[null,null,null,null,null,null,12,1482,"Christ The King School",26,220,3,0,1360260,28500,13200,0,1401960,0,null,null,1482,"LR","Christ The King School","Christ The King School Inc",26,220,3,0,1482,{"$f":"VLOOKUP(AD15,[1]Funding!$B$10:$N$77,13,FALSE)","v":1360260},{"$f":"VLOOKUP(AD15,[1]Funding!$B$10:$S$77,18,FALSE)","v":28500},{"$f":"VLOOKUP(AD15,[1]Funding!$B$10:$S$77,14,FALSE)","v":13200},{"$f":"VLOOKUP(AD15,[1]Funding!$B$10:$AE$77,30,FALSE)","v":0},1401960,{"$f":"VLOOKUP(AD15,[1]Funding!$B$10:$AF$77,31,FALSE)","v":1401960},0]
{"$rows_left_out":66}